Information card for entry 7242552
Formula | C24 H12 N4 O4 |
Calculated formula | C24 H12 N4 O4 |
Title of publication | The modulation effect of electron-rich solvents on the supramolecular networks and photochromic properties of naphthalene diimide molecules |
Authors of publication | Zhu, Huihui; Hao, Pengfei; Shen, Qiu; Shen, Junju; Li, Gaopeng; Zhao, Guozheng; Xing, Haoyu; Fu, Yunlong |
Journal of publication | CrystEngComm |
Year of publication | 2021 |
Journal volume | 23 |
Journal issue | 18 |
Pages of publication | 3356 - 3363 |
a | 4.0612 ± 0.0005 Å |
b | 25.692 ± 0.004 Å |
c | 8.6053 ± 0.0011 Å |
α | 90° |
β | 93.36 ± 0.004° |
γ | 90° |
Cell volume | 896.3 ± 0.2 Å3 |
Cell temperature | 273 ± 2 K |
Ambient diffraction temperature | 273 ± 2 K |
Number of distinct elements | 4 |
Space group number | 14 |
Hermann-Mauguin space group symbol | P 1 21/n 1 |
Hall space group symbol | -P 2yn |
Residual factor for all reflections | 0.0872 |
Residual factor for significantly intense reflections | 0.0483 |
Weighted residual factors for significantly intense reflections | 0.1084 |
Weighted residual factors for all reflections included in the refinement | 0.1243 |
Goodness-of-fit parameter for all reflections included in the refinement | 1.027 |
Diffraction radiation wavelength | 0.71073 Å |
Diffraction radiation type | MoKα |