Information card for entry 7242554
Formula | C30 H26 N6 O6 |
Calculated formula | C30 H26 N6 O6 |
Title of publication | The modulation effect of electron-rich solvents on the supramolecular networks and photochromic properties of naphthalene diimide molecules |
Authors of publication | Zhu, Huihui; Hao, Pengfei; Shen, Qiu; Shen, Junju; Li, Gaopeng; Zhao, Guozheng; Xing, Haoyu; Fu, Yunlong |
Journal of publication | CrystEngComm |
Year of publication | 2021 |
Journal volume | 23 |
Journal issue | 18 |
Pages of publication | 3356 - 3363 |
a | 5.4179 ± 0.0005 Å |
b | 20.3687 ± 0.0017 Å |
c | 12.2934 ± 0.001 Å |
α | 90° |
β | 100.926 ± 0.003° |
γ | 90° |
Cell volume | 1332.1 ± 0.2 Å3 |
Cell temperature | 293 ± 2 K |
Ambient diffraction temperature | 293 ± 2 K |
Number of distinct elements | 4 |
Space group number | 14 |
Hermann-Mauguin space group symbol | P 1 21/c 1 |
Hall space group symbol | -P 2ybc |
Residual factor for all reflections | 0.2102 |
Residual factor for significantly intense reflections | 0.108 |
Weighted residual factors for significantly intense reflections | 0.2597 |
Weighted residual factors for all reflections included in the refinement | 0.3167 |
Goodness-of-fit parameter for all reflections included in the refinement | 1.037 |
Diffraction radiation wavelength | 0.71073 Å |
Diffraction radiation type | MoKα |