Information card for entry 7242559
Formula | C30 H48 Cl2 N10 Ni2 O10 |
Calculated formula | C30 H48 Cl2 N10 Ni2 O10 |
Title of publication | Tuneable structures and magnetic properties of pseudohalo-bridged dinuclear Ni(ii) complexes derived from {N4} and {N3O} donor ligands |
Authors of publication | Adak, Sarmistha; Sun, Yu-Chen; Jana, Narayan Ch.; Brandão, Paula; Wang, Xin-Yi; Panja, Anangamohan |
Journal of publication | CrystEngComm |
Year of publication | 2021 |
Journal volume | 23 |
Journal issue | 18 |
Pages of publication | 3371 - 3382 |
a | 8.3729 ± 0.0009 Å |
b | 13.604 ± 0.0014 Å |
c | 16.8216 ± 0.0019 Å |
α | 90° |
β | 94.39 ± 0.004° |
γ | 90° |
Cell volume | 1910.4 ± 0.4 Å3 |
Cell temperature | 150 ± 2 K |
Ambient diffraction temperature | 150 ± 2 K |
Number of distinct elements | 6 |
Space group number | 14 |
Hermann-Mauguin space group symbol | P 1 21/n 1 |
Hall space group symbol | -P 2yn |
Residual factor for all reflections | 0.093 |
Residual factor for significantly intense reflections | 0.0501 |
Weighted residual factors for significantly intense reflections | 0.1035 |
Weighted residual factors for all reflections included in the refinement | 0.1184 |
Goodness-of-fit parameter for all reflections included in the refinement | 1.026 |
Diffraction radiation wavelength | 0.71073 Å |
Diffraction radiation type | MoKα |