Information card for entry 7242562
Formula | C74 H115 N17 Ni4 O12 |
Calculated formula | C74 H115 N17 Ni4 O12 |
Title of publication | Tuneable structures and magnetic properties of pseudohalo-bridged dinuclear Ni(ii) complexes derived from {N4} and {N3O} donor ligands |
Authors of publication | Adak, Sarmistha; Sun, Yu-Chen; Jana, Narayan Ch.; Brandão, Paula; Wang, Xin-Yi; Panja, Anangamohan |
Journal of publication | CrystEngComm |
Year of publication | 2021 |
Journal volume | 23 |
Journal issue | 18 |
Pages of publication | 3371 - 3382 |
a | 15.0212 ± 0.0011 Å |
b | 15.3518 ± 0.0012 Å |
c | 18.7416 ± 0.0014 Å |
α | 106.273 ± 0.003° |
β | 106.932 ± 0.003° |
γ | 91.228 ± 0.003° |
Cell volume | 3943.8 ± 0.5 Å3 |
Cell temperature | 150 ± 2 K |
Ambient diffraction temperature | 150 ± 2 K |
Number of distinct elements | 5 |
Space group number | 2 |
Hermann-Mauguin space group symbol | P -1 |
Hall space group symbol | -P 1 |
Residual factor for all reflections | 0.0464 |
Residual factor for significantly intense reflections | 0.0323 |
Weighted residual factors for significantly intense reflections | 0.0695 |
Weighted residual factors for all reflections included in the refinement | 0.0756 |
Goodness-of-fit parameter for all reflections included in the refinement | 1.019 |
Diffraction radiation wavelength | 0.71073 Å |
Diffraction radiation type | MoKα |