Information card for entry 7242572
Formula | C36 H32 Cu5 Ge N30 O44 W12 |
Calculated formula | C36 H24 Cu5 Ge N30 O46 W12 |
Title of publication | Improving the photocatalytic H2 evolution activity of Keggin polyoxometalates anchoring copper-azole complexes |
Authors of publication | Shen, Qingbo; Gómez-García, Carlos J.; Sun, Wenlong; Lai, Xiaoyong; Pang, Haijun; Ma, Huiyuan |
Journal of publication | Green Chemistry |
Year of publication | 2021 |
Journal volume | 23 |
Journal issue | 8 |
Pages of publication | 3104 - 3114 |
a | 12.203 ± 0.005 Å |
b | 13.495 ± 0.005 Å |
c | 14.262 ± 0.005 Å |
α | 104.873 ± 0.005° |
β | 111.48 ± 0.005° |
γ | 105.681 ± 0.005° |
Cell volume | 1931.3 ± 1.3 Å3 |
Cell temperature | 296 ± 2 K |
Ambient diffraction temperature | 296 ± 2 K |
Number of distinct elements | 7 |
Space group number | 2 |
Hermann-Mauguin space group symbol | P -1 |
Hall space group symbol | -P 1 |
Residual factor for all reflections | 0.1124 |
Residual factor for significantly intense reflections | 0.0934 |
Weighted residual factors for significantly intense reflections | 0.1908 |
Weighted residual factors for all reflections included in the refinement | 0.2006 |
Goodness-of-fit parameter for all reflections included in the refinement | 1.094 |
Diffraction radiation wavelength | 0.71069 Å |
Diffraction radiation type | MoKα |