Information card for entry 7242576
Formula | C15 H14 N4 O2 |
Calculated formula | C15 H14 N4 O2 |
SMILES | O=C1N(N=NN1c1cccc(OCC)c1)c1ccccc1 |
Title of publication | Cu2O nanoparticle-catalyzed synthesis of diaryl tetrazolones and investigation of their solid-state properties |
Authors of publication | Reason, Thomas E.; Goka, Benjamin; Krause, Jeanette A.; Fionah, Abelline K.; Zahran, Elsayed M.; Rayat, Sundeep |
Journal of publication | CrystEngComm |
Year of publication | 2021 |
Journal volume | 23 |
Journal issue | 17 |
Pages of publication | 3220 - 3229 |
a | 22.1904 ± 0.0017 Å |
b | 4.7324 ± 0.0004 Å |
c | 27.12 ± 0.002 Å |
α | 90° |
β | 109.172 ± 0.005° |
γ | 90° |
Cell volume | 2690 ± 0.4 Å3 |
Cell temperature | 150 ± 2 K |
Ambient diffraction temperature | 150 ± 2 K |
Number of distinct elements | 4 |
Space group number | 15 |
Hermann-Mauguin space group symbol | C 1 2/c 1 |
Hall space group symbol | -C 2yc |
Residual factor for all reflections | 0.0506 |
Residual factor for significantly intense reflections | 0.0381 |
Weighted residual factors for significantly intense reflections | 0.0891 |
Weighted residual factors for all reflections included in the refinement | 0.0971 |
Goodness-of-fit parameter for all reflections included in the refinement | 1.071 |
Diffraction radiation wavelength | 0.7288 Å |
Diffraction radiation type | synchrotron |