Information card for entry 7242579
Formula | C13 H9 F N4 O |
Calculated formula | C13 H9 F N4 O |
Title of publication | Cu2O nanoparticle-catalyzed synthesis of diaryl tetrazolones and investigation of their solid-state properties |
Authors of publication | Reason, Thomas E.; Goka, Benjamin; Krause, Jeanette A.; Fionah, Abelline K.; Zahran, Elsayed M.; Rayat, Sundeep |
Journal of publication | CrystEngComm |
Year of publication | 2021 |
Journal volume | 23 |
Journal issue | 17 |
Pages of publication | 3220 - 3229 |
a | 7.4264 ± 0.0004 Å |
b | 26.8268 ± 0.0016 Å |
c | 5.6645 ± 0.0003 Å |
α | 90° |
β | 90° |
γ | 90° |
Cell volume | 1128.52 ± 0.11 Å3 |
Cell temperature | 150 ± 2 K |
Ambient diffraction temperature | 150 ± 2 K |
Number of distinct elements | 5 |
Space group number | 62 |
Hermann-Mauguin space group symbol | P n m a |
Hall space group symbol | -P 2ac 2n |
Residual factor for all reflections | 0.0351 |
Residual factor for significantly intense reflections | 0.0325 |
Weighted residual factors for significantly intense reflections | 0.0771 |
Weighted residual factors for all reflections included in the refinement | 0.0799 |
Goodness-of-fit parameter for all reflections included in the refinement | 1.109 |
Diffraction radiation wavelength | 1.54178 Å |
Diffraction radiation type | CuKα |