Information card for entry 7242590
Common name | ORGANIC |
Formula | C128 H120 N8 O24 |
Calculated formula | C128 H120 N8 O24 |
Title of publication | Ring-opening hydrolysis of spiro-epoxyoxindoles using a reusable sulfonic acid functionalized nitrogen rich carbon catalyst |
Authors of publication | Patel, Parth; Tak, Raj Kumar; Parmar, Bhavesh; Dabas, Shilpa; Patel, Brijesh; Suresh, Eringathodi; Khan, Noor-ul H.; Subramanian, Saravanan |
Journal of publication | RSC Advances |
Year of publication | 2021 |
Journal volume | 11 |
Journal issue | 21 |
Pages of publication | 12808 - 12814 |
a | 5.1638 ± 0.0003 Å |
b | 19.306 ± 0.0012 Å |
c | 27.209 ± 0.002 Å |
α | 90° |
β | 90° |
γ | 90° |
Cell volume | 2712.5 ± 0.3 Å3 |
Cell temperature | 301 ± 2 K |
Ambient diffraction temperature | 301 ± 2 K |
Number of distinct elements | 4 |
Space group number | 19 |
Hermann-Mauguin space group symbol | P 21 21 21 |
Hall space group symbol | P 2ac 2ab |
Residual factor for all reflections | 0.2041 |
Residual factor for significantly intense reflections | 0.0621 |
Weighted residual factors for significantly intense reflections | 0.1019 |
Weighted residual factors for all reflections included in the refinement | 0.1476 |
Goodness-of-fit parameter for all reflections included in the refinement | 0.994 |
Diffraction radiation wavelength | 0.71073 Å |
Diffraction radiation type | MoKα |