Information card for entry 7242627
Formula | C21 H20 Co Mo4 N6 O18 |
Calculated formula | C21 H20 Co Mo4 N6 O18 |
Title of publication | Various amide-derived ligands induced five octamolybdate-based metal‒organic complexes: synthesis, structure, electrochemical sensing and photocatalytic properties |
Authors of publication | Wang, Xiuli; Li, Lei; Wang, Xiang; Zhang, Yuqing |
Journal of publication | CrystEngComm |
Year of publication | 2021 |
Journal volume | 23 |
Journal issue | 30 |
Pages of publication | 5176 - 5183 |
a | 15.892 ± 0.002 Å |
b | 16.61 ± 0.002 Å |
c | 16.579 ± 0.002 Å |
α | 90° |
β | 110.912 ± 0.002° |
γ | 90° |
Cell volume | 4088 ± 0.9 Å3 |
Cell temperature | 296.15 K |
Ambient diffraction temperature | 296.15 K |
Number of distinct elements | 6 |
Space group number | 14 |
Hermann-Mauguin space group symbol | P 1 21/n 1 |
Hall space group symbol | -P 2yn |
Residual factor for all reflections | 0.0505 |
Residual factor for significantly intense reflections | 0.0316 |
Weighted residual factors for significantly intense reflections | 0.0694 |
Weighted residual factors for all reflections included in the refinement | 0.0758 |
Goodness-of-fit parameter for all reflections included in the refinement | 0.932 |
Diffraction radiation wavelength | 0.71073 Å |
Diffraction radiation type | MoKα |