Information card for entry 7242629
Formula | C26 H20 Mo8 N8 O28 Zn |
Calculated formula | C26 H20 Mo8 N8 O28 Zn |
Title of publication | Various amide-derived ligands induced five octamolybdate-based metal‒organic complexes: synthesis, structure, electrochemical sensing and photocatalytic properties |
Authors of publication | Wang, Xiuli; Li, Lei; Wang, Xiang; Zhang, Yuqing |
Journal of publication | CrystEngComm |
Year of publication | 2021 |
Journal volume | 23 |
Journal issue | 30 |
Pages of publication | 5176 - 5183 |
a | 8.3998 ± 0.0003 Å |
b | 12.4831 ± 0.0004 Å |
c | 20.0657 ± 0.0007 Å |
α | 90° |
β | 94.106 ± 0.001° |
γ | 90° |
Cell volume | 2098.6 ± 0.12 Å3 |
Cell temperature | 296.15 K |
Ambient diffraction temperature | 296.15 K |
Number of distinct elements | 6 |
Space group number | 14 |
Hermann-Mauguin space group symbol | P 1 21/c 1 |
Hall space group symbol | -P 2ybc |
Residual factor for all reflections | 0.0267 |
Residual factor for significantly intense reflections | 0.0226 |
Weighted residual factors for significantly intense reflections | 0.0523 |
Weighted residual factors for all reflections included in the refinement | 0.0539 |
Goodness-of-fit parameter for all reflections included in the refinement | 1.104 |
Diffraction radiation wavelength | 0.71073 Å |
Diffraction radiation type | MoKα |