Information card for entry 7242660
Formula | C20 H16 Bi2 Br6 N4 O4 |
Calculated formula | C20 H16 Bi2 Br6 N4 O4 |
Title of publication | 2,2′-Bipyridyl-1,1′-dioxide based bismuth(iii) bromide hybrids: studies on crystal structure and luminescence |
Authors of publication | Jin, Jian-Ce; Lin, Yang-Peng; Lin, Li-Fang; Xiao, Cao; Song, Ying; Shen, Nan-Nan; Gong, Liao-Kuo; Zhang, Zhi-Zhuan; Du, Ke-Zhao; Huang, Xiao-Ying |
Journal of publication | CrystEngComm |
Year of publication | 2021 |
Journal volume | 23 |
Journal issue | 20 |
Pages of publication | 3744 - 3752 |
a | 9.5836 ± 0.0005 Å |
b | 9.5888 ± 0.0005 Å |
c | 10.0923 ± 0.0006 Å |
α | 67.643 ± 0.006° |
β | 88.319 ± 0.005° |
γ | 61.421 ± 0.005° |
Cell volume | 739.79 ± 0.09 Å3 |
Cell temperature | 100 ± 2 K |
Ambient diffraction temperature | 100 ± 2 K |
Number of distinct elements | 6 |
Space group number | 2 |
Hermann-Mauguin space group symbol | P -1 |
Hall space group symbol | -P 1 |
Residual factor for all reflections | 0.0331 |
Residual factor for significantly intense reflections | 0.029 |
Weighted residual factors for significantly intense reflections | 0.057 |
Weighted residual factors for all reflections included in the refinement | 0.06 |
Goodness-of-fit parameter for all reflections included in the refinement | 1.031 |
Diffraction radiation wavelength | 0.71073 Å |
Diffraction radiation type | MoKα |