Information card for entry 7242678
Formula | C20 H21 Cl3 N4 O2 |
Calculated formula | C20 H21 Cl3 N4 O2 |
SMILES | [Cl-].[Cl-].[Cl-].n1c(c2cc[nH+]cc2)cc(cc1c1cc[nH+]cc1)c1c[nH+]ccc1.O.O |
Title of publication | Anion-dependent structural variations and charge transport property analysis of 4′-(3-pyridyl)-4,2′:6′,4′′-terpyridinium salts |
Authors of publication | Hossain, Anowar; Dey, Arka; Seth, Saikat Kumar; Ray, Partha Pratim; Ortega-Castro, Joaquín; Frontera, Antonio; Mukhopadhyay, Subrata |
Journal of publication | CrystEngComm |
Year of publication | 2021 |
Journal volume | 23 |
Journal issue | 19 |
Pages of publication | 3569 - 3581 |
a | 4.6889 ± 0.0002 Å |
b | 27.4022 ± 0.0012 Å |
c | 16.2907 ± 0.0007 Å |
α | 90° |
β | 95.444 ± 0.002° |
γ | 90° |
Cell volume | 2083.69 ± 0.16 Å3 |
Cell temperature | 296 ± 2 K |
Ambient diffraction temperature | 296 ± 2 K |
Number of distinct elements | 5 |
Space group number | 9 |
Hermann-Mauguin space group symbol | C 1 c 1 |
Hall space group symbol | C -2yc |
Residual factor for all reflections | 0.0352 |
Residual factor for significantly intense reflections | 0.0319 |
Weighted residual factors for significantly intense reflections | 0.0794 |
Weighted residual factors for all reflections included in the refinement | 0.0815 |
Goodness-of-fit parameter for all reflections included in the refinement | 1.042 |
Diffraction radiation wavelength | 0.71073 Å |
Diffraction radiation type | MoKα |