Information card for entry 7242680
Formula | C47 H55 Ce2 N5 O20 |
Calculated formula | C47 H55 Ce2 N5 O20 |
Title of publication | 3D Ln-MOFs as multi-responsive luminescent probes for efficient sensing of Fe3+, Cr2O72−, and antibiotics in aqueous solution |
Authors of publication | Xue, Yun-Shan; Ding, Ji; Sun, Dan-Ling; Cheng, Wei-Wei; Chen, Xuan-Rong; Huang, Xing-Cai; Wang, Jun |
Journal of publication | CrystEngComm |
Year of publication | 2021 |
Journal volume | 23 |
Journal issue | 21 |
Pages of publication | 3838 - 3848 |
a | 28.619 ± 0.0012 Å |
b | 14.2049 ± 0.0005 Å |
c | 14.1485 ± 0.0006 Å |
α | 90° |
β | 100.174 ± 0.0014° |
γ | 90° |
Cell volume | 5661.4 ± 0.4 Å3 |
Cell temperature | 150 ± 2 K |
Ambient diffraction temperature | 150.01 K |
Number of distinct elements | 5 |
Space group number | 15 |
Hermann-Mauguin space group symbol | C 1 2/c 1 |
Hall space group symbol | -C 2yc |
Residual factor for all reflections | 0.0464 |
Residual factor for significantly intense reflections | 0.0419 |
Weighted residual factors for significantly intense reflections | 0.1 |
Weighted residual factors for all reflections included in the refinement | 0.1019 |
Goodness-of-fit parameter for all reflections included in the refinement | 1.233 |
Diffraction radiation wavelength | 0.71073 Å |
Diffraction radiation type | MoKα |