Information card for entry 7242682
Formula | C22 H23 Eu N2 O9 |
Calculated formula | C22 H23 Eu N2 O9 |
Title of publication | 3D Ln-MOFs as multi-responsive luminescent probes for efficient sensing of Fe3+, Cr2O72−, and antibiotics in aqueous solution |
Authors of publication | Xue, Yun-Shan; Ding, Ji; Sun, Dan-Ling; Cheng, Wei-Wei; Chen, Xuan-Rong; Huang, Xing-Cai; Wang, Jun |
Journal of publication | CrystEngComm |
Year of publication | 2021 |
Journal volume | 23 |
Journal issue | 21 |
Pages of publication | 3838 - 3848 |
a | 28.698 ± 0.004 Å |
b | 14.307 ± 0.002 Å |
c | 13.8772 ± 0.0019 Å |
α | 90° |
β | 99.521 ± 0.004° |
γ | 90° |
Cell volume | 5619.2 ± 1.4 Å3 |
Cell temperature | 293 ± 2 K |
Ambient diffraction temperature | 293 ± 2 K |
Number of distinct elements | 5 |
Space group number | 15 |
Hermann-Mauguin space group symbol | C 1 2/c 1 |
Hall space group symbol | -C 2yc |
Residual factor for all reflections | 0.0886 |
Residual factor for significantly intense reflections | 0.0554 |
Weighted residual factors for significantly intense reflections | 0.1552 |
Weighted residual factors for all reflections included in the refinement | 0.1687 |
Goodness-of-fit parameter for all reflections included in the refinement | 1.094 |
Diffraction radiation wavelength | 0.71073 Å |
Diffraction radiation type | MoKα |