Information card for entry 7242694
Formula | C28 H24 Cu2 N2 O10 |
Calculated formula | C28 H24 Cu2 N2 O10 |
Title of publication | A self-made portable separation device based on 2-D MOF nanosheets for the efficient separation of dyes in solutions |
Authors of publication | Li, Anqi; Ma, Xiaofan; Ma, Jie; Yuan, Qingyi; Zhang, Jun; Xuan, Xiaopeng |
Journal of publication | CrystEngComm |
Year of publication | 2021 |
Journal volume | 23 |
Journal issue | 22 |
Pages of publication | 3989 - 3994 |
a | 24.2206 ± 0.001 Å |
b | 18.2735 ± 0.001 Å |
c | 17.7634 ± 0.0008 Å |
α | 90° |
β | 90° |
γ | 90° |
Cell volume | 7862 ± 0.6 Å3 |
Cell temperature | 293 ± 2 K |
Ambient diffraction temperature | 293.15 K |
Number of distinct elements | 5 |
Space group number | 52 |
Hermann-Mauguin space group symbol | P n n a |
Hall space group symbol | -P 2a 2bc |
Residual factor for all reflections | 0.1148 |
Residual factor for significantly intense reflections | 0.0851 |
Weighted residual factors for significantly intense reflections | 0.1985 |
Weighted residual factors for all reflections included in the refinement | 0.2118 |
Goodness-of-fit parameter for all reflections included in the refinement | 0.968 |
Diffraction radiation probe | x-ray |
Diffraction radiation wavelength | 1.54184 Å |
Diffraction radiation type | CuKα |