Information card for entry 7242717
Formula | C93 H72 Dy2 F24 K N O16 |
Calculated formula | C93 H72 Dy2 F24 K N O16 |
Title of publication | The influence of organic bases and substituted groups on coordination structures affording two mononuclear Dy(iii) single-molecule magnets (SMMs) and a novel Dy(iii)‒K(i) compound with unusually coordinated fluorine atoms |
Authors of publication | Shen, Nan; Liang, Jing; Qu, Xiaoni; Liu, Sha; Zhu, Lin; Zhang, Sheng; Chen, Ling; Zhang, Jiangwei; Hu, Dengwei; Yin, Bing |
Journal of publication | CrystEngComm |
Year of publication | 2021 |
Journal volume | 23 |
Journal issue | 22 |
Pages of publication | 4013 - 4027 |
a | 12.7036 ± 0.0011 Å |
b | 12.9201 ± 0.0012 Å |
c | 16.3475 ± 0.0015 Å |
α | 78.309 ± 0.008° |
β | 76.098 ± 0.008° |
γ | 65.756 ± 0.009° |
Cell volume | 2358.4 ± 0.4 Å3 |
Cell temperature | 293 ± 2 K |
Ambient diffraction temperature | 293 ± 2 K |
Number of distinct elements | 7 |
Space group number | 2 |
Hermann-Mauguin space group symbol | P -1 |
Hall space group symbol | -P 1 |
Residual factor for all reflections | 0.13 |
Residual factor for significantly intense reflections | 0.0876 |
Weighted residual factors for significantly intense reflections | 0.1865 |
Weighted residual factors for all reflections included in the refinement | 0.2279 |
Goodness-of-fit parameter for all reflections included in the refinement | 1.037 |
Diffraction radiation probe | x-ray |
Diffraction radiation wavelength | 1.54184 Å |
Diffraction radiation type | CuKα |