Information card for entry 7242724
Common name | Compound MOF |
Formula | C31 H30 Co2 N4 O12 |
Calculated formula | C31 H30 Co2 N4 O12 |
Title of publication | Highly efficient methyl orange adsorption by UV-012, a new crystalline Co(ii) MOF |
Authors of publication | Ramírez, Daniel J.; Alfonso Herrera, Luis A.; Colorado-Peralta, Raúl; Rodríguez, Rodolfo Peña; Camarillo Reyes, P. K.; Chiñas, Lidia Elena; Sánchez, Mario; Rivera, José María |
Journal of publication | CrystEngComm |
Year of publication | 2021 |
Journal volume | 23 |
Journal issue | 19 |
Pages of publication | 3537 - 3548 |
a | 7.6879 ± 0.0001 Å |
b | 16.0216 ± 0.0004 Å |
c | 25.5781 ± 0.0006 Å |
α | 90° |
β | 90° |
γ | 90° |
Cell volume | 3150.52 ± 0.12 Å3 |
Cell temperature | 293 ± 2 K |
Ambient diffraction temperature | 293 ± 2 K |
Number of distinct elements | 5 |
Space group number | 56 |
Hermann-Mauguin space group symbol | P b n b |
Hall space group symbol | -P 2bc 2ab |
Residual factor for all reflections | 0.1092 |
Residual factor for significantly intense reflections | 0.0687 |
Weighted residual factors for significantly intense reflections | 0.1972 |
Weighted residual factors for all reflections included in the refinement | 0.2266 |
Goodness-of-fit parameter for all reflections included in the refinement | 1.092 |
Diffraction radiation probe | x-ray |
Diffraction radiation wavelength | 0.71073 Å |
Diffraction radiation type | MoKα |