Information card for entry 7242731
Formula | C62 H46 N10 O14 Zn2 |
Calculated formula | C62 H46 N10 O14 Zn2 |
Title of publication | 1,3-Bis(4′-carboxylatophenoxy)benzene and 3,5-bis(1-imidazoly)pyridine derived Zn(ii)/Cd(ii) coordination polymers: synthesis, structure and photocatalytic properties |
Authors of publication | Gong, Qin; Wang, Jun; Shi, Chuncheng; Liu, Qiang-Qiang; Lu, Lu; Singh, Amita; Kumar, Abhinav |
Journal of publication | CrystEngComm |
Year of publication | 2021 |
Journal volume | 23 |
Journal issue | 22 |
Pages of publication | 3981 - 3988 |
a | 8.9539 ± 0.0009 Å |
b | 11.8195 ± 0.0011 Å |
c | 15.091 ± 0.0015 Å |
α | 68.416 ± 0.001° |
β | 87.073 ± 0.002° |
γ | 72.227 ± 0.002° |
Cell volume | 1410.8 ± 0.2 Å3 |
Cell temperature | 273 ± 2 K |
Ambient diffraction temperature | 273 ± 2 K |
Number of distinct elements | 5 |
Space group number | 2 |
Hermann-Mauguin space group symbol | P -1 |
Hall space group symbol | -P 1 |
Residual factor for all reflections | 0.0656 |
Residual factor for significantly intense reflections | 0.0403 |
Weighted residual factors for significantly intense reflections | 0.0925 |
Weighted residual factors for all reflections included in the refinement | 0.1111 |
Goodness-of-fit parameter for all reflections included in the refinement | 1.007 |
Diffraction radiation wavelength | 0.71073 Å |
Diffraction radiation type | MoKα |