Information card for entry 7242761
Common name | Anthraquinone |
Chemical name | 9,10-Anthracenedione |
Formula | C14 H8 O2 |
Calculated formula | C14 H8 O2 |
Title of publication | Understanding the elastic bending mechanism in a 9,10-anthraquinone crystal through thermal expansion study |
Authors of publication | Rather, Sumair A.; Saha, Binoy K. |
Journal of publication | CrystEngComm |
Year of publication | 2021 |
Journal volume | 23 |
Journal issue | 34 |
Pages of publication | 5768 - 5773 |
a | 7.8702 ± 0.0009 Å |
b | 3.9302 ± 0.0006 Å |
c | 15.732 ± 0.002 Å |
α | 90° |
β | 102.573 ± 0.012° |
γ | 90° |
Cell volume | 474.94 ± 0.11 Å3 |
Cell temperature | 193 K |
Ambient diffraction temperature | 193 ± 0.02 K |
Number of distinct elements | 3 |
Space group number | 14 |
Hermann-Mauguin space group symbol | P 1 21/c 1 |
Hall space group symbol | -P 2ybc |
Residual factor for all reflections | 0.0841 |
Residual factor for significantly intense reflections | 0.052 |
Weighted residual factors for significantly intense reflections | 0.1191 |
Weighted residual factors for all reflections included in the refinement | 0.1411 |
Goodness-of-fit parameter for all reflections included in the refinement | 0.995 |
Diffraction radiation wavelength | 0.71073 Å |
Diffraction radiation type | MoKα |