Information card for entry 7242773
Formula | C19 H20 N4 O4 |
Calculated formula | C19 H20 N4 O4 |
SMILES | O=C1NC2(NC(=O)N(C2(N1C)c1ccccc1)C)c1ccccc1.O=CO |
Title of publication | Self-organization of 1,6-dialkyl-3a,6a-diphenylglycolurils in the crystalline state |
Authors of publication | Karnoukhova, Valentina A.; Baranov, Vladimir V.; Vologzhanina, Anna V.; Kravchenko, Angelina N.; Fedyanin, Ivan V. |
Journal of publication | CrystEngComm |
Year of publication | 2021 |
Journal volume | 23 |
Journal issue | 24 |
Pages of publication | 4312 - 4319 |
a | 9.2955 ± 0.001 Å |
b | 9.6189 ± 0.001 Å |
c | 11.1769 ± 0.0012 Å |
α | 68.975 ± 0.002° |
β | 70.514 ± 0.002° |
γ | 82.886 ± 0.002° |
Cell volume | 879.38 ± 0.16 Å3 |
Cell temperature | 100 ± 2 K |
Ambient diffraction temperature | 100 ± 2 K |
Number of distinct elements | 4 |
Space group number | 2 |
Hermann-Mauguin space group symbol | P -1 |
Hall space group symbol | -P 1 |
Residual factor for all reflections | 0.0489 |
Residual factor for significantly intense reflections | 0.041 |
Weighted residual factors for significantly intense reflections | 0.1033 |
Weighted residual factors for all reflections included in the refinement | 0.109 |
Goodness-of-fit parameter for all reflections included in the refinement | 1.037 |
Diffraction radiation wavelength | 0.71073 Å |
Diffraction radiation type | MoKα |