Information card for entry 7242780
Formula | C24 H30 N4 O4 |
Calculated formula | C24 H30 N4 O4 |
SMILES | O=C1NC2(NC(=O)N(C2(N1CC)c1ccccc1)CC)c1ccccc1.O1CCOCC1 |
Title of publication | Self-organization of 1,6-dialkyl-3a,6a-diphenylglycolurils in the crystalline state |
Authors of publication | Karnoukhova, Valentina A.; Baranov, Vladimir V.; Vologzhanina, Anna V.; Kravchenko, Angelina N.; Fedyanin, Ivan V. |
Journal of publication | CrystEngComm |
Year of publication | 2021 |
Journal volume | 23 |
Journal issue | 24 |
Pages of publication | 4312 - 4319 |
a | 8.2337 ± 0.0009 Å |
b | 10.7773 ± 0.0012 Å |
c | 12.997 ± 0.0014 Å |
α | 98.025 ± 0.003° |
β | 97.959 ± 0.003° |
γ | 91.457 ± 0.003° |
Cell volume | 1129.8 ± 0.2 Å3 |
Cell temperature | 120 ± 2 K |
Ambient diffraction temperature | 120 ± 2 K |
Number of distinct elements | 4 |
Space group number | 2 |
Hermann-Mauguin space group symbol | P -1 |
Hall space group symbol | -P 1 |
Residual factor for all reflections | 0.0839 |
Residual factor for significantly intense reflections | 0.0532 |
Weighted residual factors for significantly intense reflections | 0.1141 |
Weighted residual factors for all reflections included in the refinement | 0.1283 |
Goodness-of-fit parameter for all reflections included in the refinement | 1.03 |
Diffraction radiation wavelength | 0.71073 Å |
Diffraction radiation type | MoKα |