Information card for entry 7242823
Formula |
C34 H18 O8 Th |
Calculated formula |
C34 H18 O8 Th |
Title of publication |
Synthesis of luminescent thorium-based metal‒organic frameworks with 1,2,4,5-tetrakis(4-carboxyphenyl)benzene |
Authors of publication |
Yu, Ting; Qian, Zheng-hua; Li, Lin; Wu, Xiao-ling; He, Hui; Qiao, Yan-bo; Ye, Guo-an |
Journal of publication |
RSC Advances |
Year of publication |
2021 |
Journal volume |
11 |
Journal issue |
28 |
Pages of publication |
17431 - 17436 |
a |
5.64 ± 0.003 Å |
b |
11.024 ± 0.006 Å |
c |
28.315 ± 0.015 Å |
α |
90° |
β |
92.102 ± 0.012° |
γ |
90° |
Cell volume |
1759.3 ± 1.6 Å3 |
Cell temperature |
293 ± 2 K |
Ambient diffraction temperature |
293 ± 2 K |
Number of distinct elements |
4 |
Space group number |
13 |
Hermann-Mauguin space group symbol |
P 1 2/n 1 |
Hall space group symbol |
-P 2yac |
Residual factor for all reflections |
0.119 |
Residual factor for significantly intense reflections |
0.097 |
Weighted residual factors for significantly intense reflections |
0.2586 |
Weighted residual factors for all reflections included in the refinement |
0.2768 |
Goodness-of-fit parameter for all reflections included in the refinement |
1.064 |
Diffraction radiation wavelength |
1.34139 Å |
Diffraction radiation type |
GaKα |
Yes |
No |
No |