Information card for entry 7242825
Formula |
C34 H18 O15 Th2 |
Calculated formula |
C34 H18 O15 Th2 |
Title of publication |
Synthesis of luminescent thorium-based metal‒organic frameworks with 1,2,4,5-tetrakis(4-carboxyphenyl)benzene |
Authors of publication |
Yu, Ting; Qian, Zheng-hua; Li, Lin; Wu, Xiao-ling; He, Hui; Qiao, Yan-bo; Ye, Guo-an |
Journal of publication |
RSC Advances |
Year of publication |
2021 |
Journal volume |
11 |
Journal issue |
28 |
Pages of publication |
17431 - 17436 |
a |
33.443 ± 0.002 Å |
b |
16.4404 ± 0.0009 Å |
c |
20.0127 ± 0.0012 Å |
α |
90° |
β |
90° |
γ |
90° |
Cell volume |
11003.3 ± 1.1 Å3 |
Cell temperature |
170 ± 2 K |
Ambient diffraction temperature |
170 K |
Number of distinct elements |
4 |
Space group number |
64 |
Hermann-Mauguin space group symbol |
C m c e |
Hall space group symbol |
-C 2ac 2 |
Residual factor for all reflections |
0.0997 |
Residual factor for significantly intense reflections |
0.0808 |
Weighted residual factors for significantly intense reflections |
0.2164 |
Weighted residual factors for all reflections included in the refinement |
0.2356 |
Goodness-of-fit parameter for all reflections included in the refinement |
1.061 |
Diffraction radiation wavelength |
1.34139 Å |
Diffraction radiation type |
GaKα |
Yes |
No |
No |