Information card for entry 7242828
Formula | C24 H16 F4 I2 N2 |
Calculated formula | C24 H16 F4 I2 N2 |
Title of publication | Halogen-bonded one-dimensional chains of functionalized ditopic bipyridines co-crystallized with mono-, di-, and triiodofluorobenzenes |
Authors of publication | Vulpe, Elena; Grosjean, Sylvain; Hassan, Zahid; Bulach, Véronique; Hosseini, Mir Wais; Bräse, Stefan |
Journal of publication | CrystEngComm |
Year of publication | 2021 |
Journal volume | 23 |
Journal issue | 24 |
Pages of publication | 4247 - 4251 |
a | 6.899 ± 0.0006 Å |
b | 9.0065 ± 0.0008 Å |
c | 10.5354 ± 0.0009 Å |
α | 67.043 ± 0.002° |
β | 74.813 ± 0.0019° |
γ | 69.918 ± 0.002° |
Cell volume | 559.89 ± 0.09 Å3 |
Cell temperature | 173 ± 2 K |
Ambient diffraction temperature | 173 ± 2 K |
Number of distinct elements | 5 |
Space group number | 2 |
Hermann-Mauguin space group symbol | P -1 |
Hall space group symbol | -P 1 |
Residual factor for all reflections | 0.0697 |
Residual factor for significantly intense reflections | 0.0668 |
Weighted residual factors for significantly intense reflections | 0.156 |
Weighted residual factors for all reflections included in the refinement | 0.16 |
Goodness-of-fit parameter for all reflections included in the refinement | 1.031 |
Diffraction radiation wavelength | 0.71073 Å |
Diffraction radiation type | MoKα |