Information card for entry 7242833
Formula | C44 H28 F6 I6 N2 |
Calculated formula | C44 H28 F6 I6 N2 |
Title of publication | Halogen-bonded one-dimensional chains of functionalized ditopic bipyridines co-crystallized with mono-, di-, and triiodofluorobenzenes |
Authors of publication | Vulpe, Elena; Grosjean, Sylvain; Hassan, Zahid; Bulach, Véronique; Hosseini, Mir Wais; Bräse, Stefan |
Journal of publication | CrystEngComm |
Year of publication | 2021 |
Journal volume | 23 |
Journal issue | 24 |
Pages of publication | 4247 - 4251 |
a | 7.782 ± 0.0003 Å |
b | 33.4952 ± 0.0014 Å |
c | 9.1815 ± 0.0004 Å |
α | 90° |
β | 114.99 ± 0.0011° |
γ | 90° |
Cell volume | 2169.2 ± 0.16 Å3 |
Cell temperature | 173 ± 2 K |
Ambient diffraction temperature | 173 ± 2 K |
Number of distinct elements | 5 |
Space group number | 14 |
Hermann-Mauguin space group symbol | P 1 21/c 1 |
Hall space group symbol | -P 2ybc |
Residual factor for all reflections | 0.0432 |
Residual factor for significantly intense reflections | 0.0353 |
Weighted residual factors for significantly intense reflections | 0.0825 |
Weighted residual factors for all reflections included in the refinement | 0.0863 |
Goodness-of-fit parameter for all reflections included in the refinement | 1.048 |
Diffraction radiation wavelength | 0.71073 Å |
Diffraction radiation type | MoKα |