Information card for entry 7242836
Common name | amoxicillin sodium solvate |
Formula | C20 H28 N3 Na O8 S |
Calculated formula | C20 H28 N3 Na O8 S |
Title of publication | Two isomeric zeolite-like metal‒organic frameworks with mechanically responsive luminescence emission and gas adsorption properties |
Authors of publication | Peng, Shuang; Qi, Yan-Jie; Li, Xin-Hao; Sun, Cai; Li, Ling-Yun; Li, Xin-Xiong; Zheng, Shou-Tian; Zhang, Qichun |
Journal of publication | CrystEngComm |
Year of publication | 2021 |
Journal volume | 23 |
Journal issue | 34 |
Pages of publication | 5753 - 5757 |
a | 9.9361 ± 0.0007 Å |
b | 15.3223 ± 0.001 Å |
c | 15.6894 ± 0.0009 Å |
α | 90° |
β | 90° |
γ | 90° |
Cell volume | 2388.6 ± 0.3 Å3 |
Cell temperature | 113.15 K |
Ambient diffraction temperature | 113.15 K |
Number of distinct elements | 6 |
Space group number | 19 |
Hermann-Mauguin space group symbol | P 21 21 21 |
Hall space group symbol | P 2ac 2ab |
Residual factor for all reflections | 0.0898 |
Residual factor for significantly intense reflections | 0.0659 |
Weighted residual factors for significantly intense reflections | 0.1329 |
Weighted residual factors for all reflections included in the refinement | 0.1516 |
Goodness-of-fit parameter for all reflections included in the refinement | 1.056 |
Diffraction radiation probe | x-ray |
Diffraction radiation wavelength | 0.71073 Å |
Diffraction radiation type | MoKα |