Information card for entry 7242838
Formula | C15 H14 Cl2 N2 |
Calculated formula | C15 H14 Cl2 N2 |
Title of publication | Predicting molecular isomerism of symmetrical and unsymmetrical N,N′-diphenyl formamidines in the solid-state: crystal structure, Hirshfeld surface analysis, pairwise interaction energy, and ΔHfusion and ΔSfusion correlations |
Authors of publication | Zamisa, Sizwe J.; Bongoza, Unathi; Omondi, Bernard |
Journal of publication | CrystEngComm |
Year of publication | 2021 |
Journal volume | 23 |
Journal issue | 25 |
Pages of publication | 4459 - 4474 |
a | 10.6079 ± 0.0003 Å |
b | 42.6839 ± 0.0012 Å |
c | 8.2782 ± 0.0002 Å |
α | 90° |
β | 128.984 ± 0.001° |
γ | 90° |
Cell volume | 2913.6 ± 0.14 Å3 |
Cell temperature | 173.15 K |
Ambient diffraction temperature | 173.15 K |
Number of distinct elements | 4 |
Space group number | 9 |
Hermann-Mauguin space group symbol | C 1 c 1 |
Hall space group symbol | C -2yc |
Residual factor for all reflections | 0.035 |
Residual factor for significantly intense reflections | 0.0339 |
Weighted residual factors for significantly intense reflections | 0.09 |
Weighted residual factors for all reflections included in the refinement | 0.0907 |
Goodness-of-fit parameter for all reflections included in the refinement | 1.046 |
Diffraction radiation probe | x-ray |
Diffraction radiation wavelength | 0.71073 Å |
Diffraction radiation type | MoKα |