Information card for entry 7242894
Formula | C23 H33 Co N5 O10 S |
Calculated formula | C23 H33 Co N5 O10 S |
Title of publication | A newly-constructed hydrolytically stable Co(ii) coordination polymer showing dual responsive fluorescence sensing of pH and Cu2+ |
Authors of publication | Yan, Min; Zhu, Peizhi; Yang, Shengyang; Kong, Wei-Jian; Wang, Jian; Zhang, Kou-Lin |
Journal of publication | CrystEngComm |
Year of publication | 2021 |
Journal volume | 23 |
Journal issue | 24 |
Pages of publication | 4370 - 4381 |
a | 7.144 ± 0.008 Å |
b | 12.849 ± 0.017 Å |
c | 15.65 ± 0.02 Å |
α | 75.61 ± 0.03° |
β | 83.28 ± 0.03° |
γ | 83.22 ± 0.03° |
Cell volume | 1376 ± 3 Å3 |
Cell temperature | 293 ± 2 K |
Ambient diffraction temperature | 293 ± 2 K |
Number of distinct elements | 6 |
Space group number | 2 |
Hermann-Mauguin space group symbol | P -1 |
Hall space group symbol | -P 1 |
Residual factor for all reflections | 0.1043 |
Residual factor for significantly intense reflections | 0.0528 |
Weighted residual factors for significantly intense reflections | 0.0979 |
Weighted residual factors for all reflections included in the refinement | 0.1131 |
Goodness-of-fit parameter for all reflections included in the refinement | 1.011 |
Diffraction radiation wavelength | 0.71073 Å |
Diffraction radiation type | MoKα |