Information card for entry 7242899
Formula | C12 H12 Na3.8 O45 Ru2 W8 |
Calculated formula | C12 H12 Na3.8 O45 Ru2 W8 |
Title of publication | Unusual π‒π interactions directed by the [{(C6H6)Ru}2W8O30(OH)2]6− hybrid anion |
Authors of publication | Mukhacheva, Anna A.; Komarov, Vladislav Yu.; Kokovkin, Vasily V.; Novikov, Alexander S.; Abramov, Pavel A.; Sokolov, Maxim N. |
Journal of publication | CrystEngComm |
Year of publication | 2021 |
Journal volume | 23 |
Journal issue | 23 |
Pages of publication | 4125 - 4135 |
a | 10.3129 ± 0.0004 Å |
b | 16.4452 ± 0.0006 Å |
c | 14.8941 ± 0.0005 Å |
α | 90° |
β | 103.446 ± 0.002° |
γ | 90° |
Cell volume | 2456.77 ± 0.16 Å3 |
Cell temperature | 150 ± 2 K |
Ambient diffraction temperature | 150 ± 2 K |
Number of distinct elements | 6 |
Space group number | 14 |
Hermann-Mauguin space group symbol | P 1 21/n 1 |
Hall space group symbol | -P 2yn |
Residual factor for all reflections | 0.1002 |
Residual factor for significantly intense reflections | 0.0513 |
Weighted residual factors for significantly intense reflections | 0.112 |
Weighted residual factors for all reflections included in the refinement | 0.1285 |
Goodness-of-fit parameter for all reflections included in the refinement | 0.948 |
Diffraction radiation probe | x-ray |
Diffraction radiation wavelength | 0.71073 Å |
Diffraction radiation type | MoKα |