Information card for entry 7242919
Formula | C24 H23 B Dy Fe N14 O9 |
Calculated formula | C24 H23 B Dy Fe N14 O9 |
Title of publication | Cyanido-bridged {FeIIILnIII} heterobimetallic chains assembled through the [FeIII{HB(pz)3}(CN)3]− complex as metalloligand: synthesis, crystal structure and magnetic properties |
Authors of publication | Visinescu, Diana; Alexandru, Maria-Gabriela; Dumitrescu, Dan G.; Shova, Sergiu; Moliner, Nicolás; Lloret, Francesc; Julve, Miguel |
Journal of publication | CrystEngComm |
Year of publication | 2021 |
Journal volume | 23 |
Journal issue | 26 |
Pages of publication | 4615 - 4626 |
a | 17.196 ± 0.003 Å |
b | 14.198 ± 0.003 Å |
c | 13.203 ± 0.003 Å |
α | 90° |
β | 90.97 ± 0.03° |
γ | 90° |
Cell volume | 3223 ± 1.1 Å3 |
Cell temperature | 293 ± 2 K |
Ambient diffraction temperature | 293 ± 2 K |
Number of distinct elements | 7 |
Space group number | 14 |
Hermann-Mauguin space group symbol | P 1 21/c 1 |
Hall space group symbol | -P 2ybc |
Residual factor for all reflections | 0.0571 |
Residual factor for significantly intense reflections | 0.0494 |
Weighted residual factors for significantly intense reflections | 0.1332 |
Weighted residual factors for all reflections included in the refinement | 0.138 |
Goodness-of-fit parameter for all reflections included in the refinement | 1.067 |
Diffraction radiation wavelength | 0.71073 Å |
Diffraction radiation type | MoKα |