Information card for entry 7242926
Formula | C26 H16 Cd Cl N6 O11 |
Calculated formula | C26 H16 Cd Cl N6 O11 |
Title of publication | A multifunctional colorimetric sensor originating from a cadmium naphthalene diimide-based metal‒organic framework: photochromism, hydrochromism, and vapochromism |
Authors of publication | Zhang, Guoshuai; Fu, Chen; Zhang, Heyi; Zhang, Hong |
Journal of publication | CrystEngComm |
Year of publication | 2021 |
Journal volume | 23 |
Journal issue | 25 |
Pages of publication | 4513 - 4521 |
a | 6.6598 ± 0.0004 Å |
b | 10.7886 ± 0.0006 Å |
c | 19.2106 ± 0.0008 Å |
α | 96.432 ± 0.002° |
β | 98.294 ± 0.002° |
γ | 107.416 ± 0.002° |
Cell volume | 1285.5 ± 0.12 Å3 |
Cell temperature | 300 ± 2 K |
Ambient diffraction temperature | 300 ± 2 K |
Number of distinct elements | 6 |
Space group number | 2 |
Hermann-Mauguin space group symbol | P -1 |
Hall space group symbol | -P 1 |
Residual factor for all reflections | 0.0329 |
Residual factor for significantly intense reflections | 0.0268 |
Weighted residual factors for significantly intense reflections | 0.0664 |
Weighted residual factors for all reflections included in the refinement | 0.0693 |
Goodness-of-fit parameter for all reflections included in the refinement | 1.084 |
Diffraction radiation wavelength | 0.71073 Å |
Diffraction radiation type | MoKα |