Information card for entry 7242932
Chemical name | 1,2,2,8,8-Pentamethyl-1,2,3,4-tetrahydro-8H-spiro[1,3-dioxane-5,3-fluoreno[4,5-bcd]azocine]-4,6-dione |
Formula | C24 H25 N O4 |
Calculated formula | C24 H25 N O4 |
SMILES | O=C1OC(OC(=O)C21CN(c1cccc3c1c1c(cccc1C3(C)C)C2)C)(C)C |
Title of publication | Interaction, bond formation or reaction between a dimethylamino group and an adjacent alkene or aldehyde group in aromatic systems controlled by remote molecular constraints |
Authors of publication | Bristow, Jonathan C.; Cliff, Stacey V. A.; Yang, Songjie; Wallis, John D. |
Journal of publication | CrystEngComm |
Year of publication | 2021 |
Journal volume | 23 |
Journal issue | 25 |
Pages of publication | 4500 - 4512 |
a | 10.9539 ± 0.0003 Å |
b | 9.5493 ± 0.0003 Å |
c | 19.3902 ± 0.0006 Å |
α | 90° |
β | 104.652 ± 0.003° |
γ | 90° |
Cell volume | 1962.3 ± 0.11 Å3 |
Cell temperature | 150 ± 0.1 K |
Ambient diffraction temperature | 150 ± 0.1 K |
Number of distinct elements | 4 |
Space group number | 14 |
Hermann-Mauguin space group symbol | P 1 21/n 1 |
Hall space group symbol | -P 2yn |
Residual factor for all reflections | 0.0681 |
Residual factor for significantly intense reflections | 0.051 |
Weighted residual factors for significantly intense reflections | 0.103 |
Weighted residual factors for all reflections included in the refinement | 0.1109 |
Goodness-of-fit parameter for all reflections included in the refinement | 1.057 |
Diffraction radiation probe | x-ray |
Diffraction radiation wavelength | 0.71073 Å |
Diffraction radiation type | MoKα |