Information card for entry 7242935
Chemical name | 3-Nitro-1,2,3,4-tetrahydro-1,8,8-trimethyl-8H-fluoreno[4,5-bcd]azocine |
Formula | C19 H20 N2 O2 |
Calculated formula | C19 H20 N2 O2 |
Title of publication | Interaction, bond formation or reaction between a dimethylamino group and an adjacent alkene or aldehyde group in aromatic systems controlled by remote molecular constraints |
Authors of publication | Bristow, Jonathan C.; Cliff, Stacey V. A.; Yang, Songjie; Wallis, John D. |
Journal of publication | CrystEngComm |
Year of publication | 2021 |
Journal volume | 23 |
Journal issue | 25 |
Pages of publication | 4500 - 4512 |
a | 9.7431 ± 0.0003 Å |
b | 6.9459 ± 0.0002 Å |
c | 12.1403 ± 0.0004 Å |
α | 90° |
β | 105.257 ± 0.004° |
γ | 90° |
Cell volume | 792.63 ± 0.05 Å3 |
Cell temperature | 150.01 ± 0.1 K |
Ambient diffraction temperature | 150.01 ± 0.1 K |
Number of distinct elements | 4 |
Space group number | 4 |
Hermann-Mauguin space group symbol | P 1 21 1 |
Hall space group symbol | P 2yb |
Residual factor for all reflections | 0.052 |
Residual factor for significantly intense reflections | 0.0462 |
Weighted residual factors for significantly intense reflections | 0.0935 |
Weighted residual factors for all reflections included in the refinement | 0.0961 |
Goodness-of-fit parameter for all reflections included in the refinement | 1.077 |
Diffraction radiation probe | x-ray |
Diffraction radiation wavelength | 0.71073 Å |
Diffraction radiation type | MoKα |