Information card for entry 7242958
Formula | C10 H16 Ag N5 O3 S2 |
Calculated formula | C10 H16 Ag N5 O3 S2 |
Title of publication | 2D and 3D silver-based coordination polymers with thiomorpholine-4-carbonitrile and piperazine-1,4-dicarbonitrile: structure, intermolecular interactions, photocatalysis, and thermal behavior |
Authors of publication | Ristić, Predrag; Filipović, Nenad; Blagojević, Vladimir; Ćirković, Jovana; Holló, Berta Barta; Đokić, Veljko R.; Donnard, Morgan; Gulea, Mihaela; Marjanović, Ivana; Klisurić, Olivera R.; Todorović, Tamara R. |
Journal of publication | CrystEngComm |
Year of publication | 2021 |
Journal volume | 23 |
Journal issue | 27 |
Pages of publication | 4799 - 4815 |
a | 13.1512 ± 0.0005 Å |
b | 13.1512 ± 0.0005 Å |
c | 4.3773 ± 0.0003 Å |
α | 90° |
β | 90° |
γ | 90° |
Cell volume | 757.07 ± 0.07 Å3 |
Cell temperature | 293 ± 2 K |
Ambient diffraction temperature | 293 ± 2 K |
Number of distinct elements | 6 |
Space group number | 113 |
Hermann-Mauguin space group symbol | P -4 21 m |
Hall space group symbol | P -4 2ab |
Residual factor for all reflections | 0.0373 |
Residual factor for significantly intense reflections | 0.0284 |
Weighted residual factors for significantly intense reflections | 0.0532 |
Weighted residual factors for all reflections included in the refinement | 0.058 |
Goodness-of-fit parameter for all reflections included in the refinement | 1.044 |
Diffraction radiation wavelength | 0.71073 Å |
Diffraction radiation type | MoKα |