Information card for entry 7242977
Chemical name | 2,6-diamino-3,5-difluorobenzonitrile and 18-crown-6, 1:1 co-crystal |
Formula | C19 H29 F2 N3 O6 |
Calculated formula | C19 H29 F2 N3 O6 |
Title of publication | Co-crystals of polyhalogenated diaminobenzonitriles with 18-crown-6: effect of fluorine on the stoichiometry and supramolecular structure |
Authors of publication | Vaganova, Tamara A.; Gatilov, Yurij V.; Malykhin, Sergey E.; Pishchur, Denis P.; Sukhov, Maxim; Zakharov, Boris A.; Boldyreva, Elena V.; Malykhin, Evgenij V. |
Journal of publication | CrystEngComm |
Year of publication | 2021 |
Journal volume | 23 |
Journal issue | 27 |
Pages of publication | 4767 - 4781 |
a | 13.4328 ± 0.0006 Å |
b | 16.8984 ± 0.0008 Å |
c | 9.2577 ± 0.0004 Å |
α | 90° |
β | 96.591 ± 0.002° |
γ | 90° |
Cell volume | 2087.54 ± 0.16 Å3 |
Cell temperature | 200 ± 2 K |
Ambient diffraction temperature | 200 ± 2 K |
Number of distinct elements | 5 |
Space group number | 15 |
Hermann-Mauguin space group symbol | C 1 2/c 1 |
Hall space group symbol | -C 2yc |
Residual factor for all reflections | 0.0499 |
Residual factor for significantly intense reflections | 0.0348 |
Weighted residual factors for significantly intense reflections | 0.0999 |
Weighted residual factors for all reflections included in the refinement | 0.1138 |
Goodness-of-fit parameter for all reflections included in the refinement | 0.987 |
Diffraction radiation wavelength | 0.71073 Å |
Diffraction radiation type | MoKα |