Information card for entry 7242983
Formula | C21 H16 Cl2 N2 O2 |
Calculated formula | C21 H16 Cl2 N2 O2 |
SMILES | Clc1ccc(C2NC(=O)C3C=2C(=O)N(C=3c2ccc(Cl)cc2)CCC)cc1 |
Title of publication | Chlorinated diketopyrrolopyrrole dye exhibits a three-step polymorphic transition with thermosalient effects |
Authors of publication | Kikuchi, Yusuke; Matsumoto, Shinya |
Journal of publication | CrystEngComm |
Year of publication | 2021 |
Journal volume | 23 |
Journal issue | 34 |
Pages of publication | 5882 - 5890 |
a | 6.1089 ± 0.0002 Å |
b | 9.6567 ± 0.0005 Å |
c | 15.8773 ± 0.0006 Å |
α | 87.008 ± 0.004° |
β | 88.263 ± 0.003° |
γ | 88.159 ± 0.003° |
Cell volume | 934.49 ± 0.07 Å3 |
Cell temperature | 223 ± 2 K |
Ambient diffraction temperature | 223 ± 2 K |
Number of distinct elements | 5 |
Space group number | 2 |
Hermann-Mauguin space group symbol | P -1 |
Hall space group symbol | -P 1 |
Residual factor for all reflections | 0.0659 |
Residual factor for significantly intense reflections | 0.0555 |
Weighted residual factors for significantly intense reflections | 0.1551 |
Weighted residual factors for all reflections included in the refinement | 0.1754 |
Goodness-of-fit parameter for all reflections included in the refinement | 1.011 |
Diffraction radiation probe | x-ray |
Diffraction radiation wavelength | 1.54184 Å |
Diffraction radiation type | CuKα |