Information card for entry 7242987
Formula | C16 H8 Co1.2 Ni1.8 O10 |
Calculated formula | C16 H8 Co1.2 Ni1.8 O10 |
Title of publication | Two-dimensional stable and ultrathin cluster-based metal‒organic layers for efficient electrocatalytic water oxidation |
Authors of publication | Yu, Bin-Bin; Hua, Yi-Wei; Huang, Qi; Ye, Si-Yuan; Zhang, Hao-Dong; Yan, Zheng; Li, Rui-Wen; Wu, Jun; Meng, Yan; Cao, Xuebo |
Journal of publication | CrystEngComm |
Year of publication | 2021 |
Journal volume | 23 |
Journal issue | 26 |
Pages of publication | 4700 - 4707 |
a | 11.7117 ± 0.0014 Å |
b | 12.099 ± 0.0013 Å |
c | 11.7979 ± 0.0013 Å |
α | 90° |
β | 103.17 ± 0.012° |
γ | 90° |
Cell volume | 1627.8 ± 0.3 Å3 |
Cell temperature | 293 ± 2 K |
Ambient diffraction temperature | 293 ± 2 K |
Number of distinct elements | 5 |
Space group number | 14 |
Hermann-Mauguin space group symbol | P 1 21/c 1 |
Hall space group symbol | -P 2ybc |
Residual factor for all reflections | 0.1264 |
Residual factor for significantly intense reflections | 0.0866 |
Weighted residual factors for significantly intense reflections | 0.2141 |
Weighted residual factors for all reflections included in the refinement | 0.255 |
Goodness-of-fit parameter for all reflections included in the refinement | 1.001 |
Diffraction radiation probe | x-ray |
Diffraction radiation wavelength | 1.54184 Å |
Diffraction radiation type | CuKα |