Information card for entry 7243034
Chemical name | 8,8-Dimethyl-6,7,8,11-tetrahydro-9H-indeno[1,2-b]quinolin-9-one |
Formula | C18 H17 N O |
Calculated formula | C18 H17 N O |
Title of publication | Indium(iii)-catalyzed solvent-free multicomponent [2 + 2 + 1 + 1]-annulation to polycyclic functionalized fused pyridines as potential optical chemosensors |
Authors of publication | Jamshaid, Sana; Mohandoss, Sonaimuthu; Lee, Yong Rok |
Journal of publication | Green Chemistry |
Year of publication | 2021 |
Journal volume | 23 |
Journal issue | 14 |
Pages of publication | 5113 - 5119 |
a | 5.8897 ± 0.0012 Å |
b | 19.96 ± 0.004 Å |
c | 11.987 ± 0.003 Å |
α | 90° |
β | 103.094 ± 0.007° |
γ | 90° |
Cell volume | 1372.5 ± 0.5 Å3 |
Cell temperature | 223 ± 2 K |
Ambient diffraction temperature | 223 ± 2 K |
Number of distinct elements | 4 |
Space group number | 14 |
Hermann-Mauguin space group symbol | P 1 21/n 1 |
Hall space group symbol | -P 2yn |
Residual factor for all reflections | 0.0915 |
Residual factor for significantly intense reflections | 0.0567 |
Weighted residual factors for significantly intense reflections | 0.1367 |
Weighted residual factors for all reflections included in the refinement | 0.1594 |
Goodness-of-fit parameter for all reflections included in the refinement | 1.042 |
Diffraction radiation wavelength | 0.71073 Å |
Diffraction radiation type | MoKα |