Information card for entry 7243129
Formula | C16 H16 Co0.67 N2 O6 |
Calculated formula | C16 H16 Co0.666667 N2 O6 |
Title of publication | Synthesis and characterization of new coordination compounds by the use of 2-pyridinemethanol and di- or tricarboxylic acids |
Authors of publication | Mylonas-Margaritis, Ioannis; Mayans, Júlia; Tong, Wenming; Farràs, Pau; Escuer, Albert; McArdle, Patrick; Papatriantafyllopoulou, Constantina |
Journal of publication | CrystEngComm |
Year of publication | 2021 |
Journal volume | 23 |
Journal issue | 32 |
Pages of publication | 5489 - 5497 |
a | 20.5149 ± 0.0008 Å |
b | 16.0901 ± 0.0012 Å |
c | 15.5524 ± 0.0005 Å |
α | 90° |
β | 90° |
γ | 90° |
Cell volume | 5133.6 ± 0.5 Å3 |
Cell temperature | 296.3 ± 0.9 K |
Ambient diffraction temperature | 296.3 ± 0.9 K |
Number of distinct elements | 5 |
Space group number | 64 |
Hermann-Mauguin space group symbol | C m c e |
Hall space group symbol | -C 2ac 2 |
Residual factor for all reflections | 0.1258 |
Residual factor for significantly intense reflections | 0.0598 |
Weighted residual factors for significantly intense reflections | 0.1331 |
Weighted residual factors for all reflections included in the refinement | 0.1626 |
Goodness-of-fit parameter for all reflections included in the refinement | 1 |
Diffraction radiation wavelength | 0.71073 Å |
Diffraction radiation type | MoKα |