Information card for entry 7243617
Formula | C8 H9 Ga N O11 P |
Calculated formula | C8 H9 Ga N O11 P |
Title of publication | Isonicotinic acid-templated metal phosphate–oxalates: solvent-free synthesis, luminescence, and proton conduction |
Authors of publication | Huang, Lijuan; Xu, Haiping; Zhao, Yan; Huang, Ling; Bi, Jian; Zeng, Hongmei; Zou, Guohong; Gao, Daojiang; Lin, Zhien |
Journal of publication | CrystEngComm |
Year of publication | 2021 |
Journal volume | 23 |
Journal issue | 39 |
Pages of publication | 6855 - 6858 |
a | 7.8667 ± 0.0004 Å |
b | 16.1141 ± 0.0006 Å |
c | 21.1102 ± 0.0014 Å |
α | 90° |
β | 90.836 ± 0.005° |
γ | 90° |
Cell volume | 2675.7 ± 0.2 Å3 |
Cell temperature | 293 ± 2 K |
Ambient diffraction temperature | 293 ± 2 K |
Number of distinct elements | 6 |
Space group number | 15 |
Hermann-Mauguin space group symbol | C 1 2/c 1 |
Hall space group symbol | -C 2yc |
Residual factor for all reflections | 0.0484 |
Residual factor for significantly intense reflections | 0.0393 |
Weighted residual factors for significantly intense reflections | 0.0916 |
Weighted residual factors for all reflections included in the refinement | 0.0965 |
Goodness-of-fit parameter for all reflections included in the refinement | 1.07 |
Diffraction radiation probe | x-ray |
Diffraction radiation wavelength | 0.71073 Å |
Diffraction radiation type | MoKα |