Information card for entry 7243743
Formula | C15 H14 Fe O7 |
Calculated formula | C15 H14 Fe O7 |
SMILES | [Fe]123([C]4(OC(=O)CC(=C)C(=O)OC)=[CH]1[CH]2=[CH]3CC4)(C#[O])(C#[O])C#[O] |
Title of publication | ItaCORMs: Conjugation with a CO-releasing Unit greatly Enhances the Anti-inflammatory Activity of Itaconates |
Authors of publication | Krause, Bernhard Markus; Bauer, Britta; Neudoerfl, Joerg; Wieder, Thomas; Schmalz, Hans Günther |
Journal of publication | RSC Medicinal Chemistry |
Year of publication | 2021 |
a | 7.1067 ± 0.0003 Å |
b | 12.2043 ± 0.0005 Å |
c | 9.3734 ± 0.0004 Å |
α | 90° |
β | 104.11 ± 0.002° |
γ | 90° |
Cell volume | 788.45 ± 0.06 Å3 |
Cell temperature | 100 ± 2 K |
Ambient diffraction temperature | 100 ± 2 K |
Number of distinct elements | 4 |
Space group number | 4 |
Hermann-Mauguin space group symbol | P 1 21 1 |
Hall space group symbol | P 2yb |
Residual factor for all reflections | 0.0471 |
Residual factor for significantly intense reflections | 0.0431 |
Weighted residual factors for significantly intense reflections | 0.1008 |
Weighted residual factors for all reflections included in the refinement | 0.1039 |
Goodness-of-fit parameter for all reflections included in the refinement | 1.071 |
Diffraction radiation wavelength | 1.54178 Å |
Diffraction radiation type | CuKα |