Information card for entry 7243745
Chemical name | Compound 3 |
Formula | C26 H28 Co2 Mo8 N8 O35 |
Calculated formula | C26 H28 Co2 Mo8 N8 O35 |
Title of publication | A series of polyoxometalate-based hybrid complexes constructed by a tripodal ligand containing mixed N/O donors |
Authors of publication | Ying, Jun; Jin, Liang; Yu, Hai-Yan; Tian, Ai-Xiang; Wang, Xiu-Li |
Journal of publication | CrystEngComm |
Year of publication | 2021 |
Journal volume | 23 |
Journal issue | 44 |
Pages of publication | 7846 - 7854 |
a | 9.5767 ± 0.0013 Å |
b | 11.1881 ± 0.0015 Å |
c | 12.2524 ± 0.0017 Å |
α | 83.416 ± 0.003° |
β | 68.138 ± 0.002° |
γ | 73.915 ± 0.002° |
Cell volume | 1170.6 ± 0.3 Å3 |
Cell temperature | 296.15 K |
Ambient diffraction temperature | 296.15 K |
Number of distinct elements | 6 |
Space group number | 2 |
Hermann-Mauguin space group symbol | P -1 |
Hall space group symbol | -P 1 |
Residual factor for all reflections | 0.0461 |
Residual factor for significantly intense reflections | 0.0363 |
Weighted residual factors for significantly intense reflections | 0.0978 |
Weighted residual factors for all reflections included in the refinement | 0.1035 |
Goodness-of-fit parameter for all reflections included in the refinement | 1.086 |
Diffraction radiation wavelength | 0.71073 Å |
Diffraction radiation type | MoKα |