Information card for entry 7243751
Formula | C26 H14 La N2.3 O10.9 |
Calculated formula | C26 H14 La N2.3 O10.9 |
Title of publication | A water-stable photochromic MOF with controllable iodine sorption and efficient removal of dichromate |
Authors of publication | Liu, Jian-Jun; Fu, Jia-Jia; Li, Gui-Jun; Liu, Teng; Xia, Shu-Biao; Cheng, Fei-Xiang |
Journal of publication | CrystEngComm |
Year of publication | 2021 |
Journal volume | 23 |
Journal issue | 43 |
Pages of publication | 7628 - 7634 |
a | 9.3815 ± 0.0008 Å |
b | 12.1909 ± 0.001 Å |
c | 14.0591 ± 0.0011 Å |
α | 92.007 ± 0.006° |
β | 101.5 ± 0.007° |
γ | 101.086 ± 0.007° |
Cell volume | 1541.7 ± 0.2 Å3 |
Cell temperature | 153 ± 2 K |
Ambient diffraction temperature | 153 ± 2 K |
Number of distinct elements | 5 |
Space group number | 2 |
Hermann-Mauguin space group symbol | P -1 |
Hall space group symbol | -P 1 |
Residual factor for all reflections | 0.0599 |
Residual factor for significantly intense reflections | 0.0507 |
Weighted residual factors for significantly intense reflections | 0.1274 |
Weighted residual factors for all reflections included in the refinement | 0.1306 |
Goodness-of-fit parameter for all reflections included in the refinement | 1.112 |
Diffraction radiation wavelength | 0.71073 Å |
Diffraction radiation type | MoKα |