Information card for entry 7243764
Formula | C23 H20 F N3 O2 S |
Calculated formula | C23 H20 F N3 O2 S |
SMILES | S(=O)(=O)(Nc1cc(F)ccc1)c1cc(ccc1)C.n1ccc(cc1)c1ccncc1 |
Title of publication | Relationship between crystal shape and unit cell shape: crystal shape modification via co-crystallization toward SXRD-suitable crystals |
Authors of publication | Okayasu, Misaki; Kikkawa, Shoko; Hikawa, Hidemasa; Azumaya, Isao |
Journal of publication | CrystEngComm |
Year of publication | 2021 |
Journal volume | 23 |
Journal issue | 44 |
Pages of publication | 7760 - 7770 |
a | 10.2247 ± 0.0006 Å |
b | 13.3486 ± 0.0006 Å |
c | 15.0139 ± 0.0013 Å |
α | 90° |
β | 98.168 ± 0.007° |
γ | 90° |
Cell volume | 2028.4 ± 0.2 Å3 |
Cell temperature | 93 K |
Ambient diffraction temperature | 93 K |
Number of distinct elements | 6 |
Space group number | 14 |
Hermann-Mauguin space group symbol | P 1 21/c 1 |
Hall space group symbol | -P 2ybc |
Residual factor for all reflections | 0.1268 |
Residual factor for significantly intense reflections | 0.0632 |
Weighted residual factors for significantly intense reflections | 0.1393 |
Weighted residual factors for all reflections included in the refinement | 0.162 |
Goodness-of-fit parameter for all reflections included in the refinement | 1.03 |
Diffraction radiation wavelength | 0.71073 Å |
Diffraction radiation type | MoKα |