Information card for entry 7243863
Formula | C21 H18 Cd N2 O6 |
Calculated formula | C21 H18 Cd N2 O6 |
Title of publication | Various carboxylates induced eight Zn(ii)/Cd(ii) coordination polymers with fluorescence sensing activities for Fe(iii), Cr(vi) and oxytetracycline |
Authors of publication | Chen, Yaxuan; Liu, Guocheng; Wang, Xiuli; Lu, Xue; Xu, Na; Chang, Zhihan; Zhang, Zhong; Li, Xiaohui |
Journal of publication | CrystEngComm |
Year of publication | 2021 |
Journal volume | 23 |
Journal issue | 46 |
Pages of publication | 8077 - 8086 |
a | 8.604 ± 0.005 Å |
b | 10.136 ± 0.005 Å |
c | 11.831 ± 0.005 Å |
α | 90.865 ± 0.005° |
β | 101.993 ± 0.005° |
γ | 101.402 ± 0.005° |
Cell volume | 987.6 ± 0.9 Å3 |
Cell temperature | 296 ± 2 K |
Ambient diffraction temperature | 296 ± 2 K |
Number of distinct elements | 5 |
Space group number | 2 |
Hermann-Mauguin space group symbol | P -1 |
Hall space group symbol | -P 1 |
Residual factor for all reflections | 0.055 |
Residual factor for significantly intense reflections | 0.0421 |
Weighted residual factors for significantly intense reflections | 0.1066 |
Weighted residual factors for all reflections included in the refinement | 0.1139 |
Goodness-of-fit parameter for all reflections included in the refinement | 1.021 |
Diffraction radiation wavelength | 0.71069 Å |
Diffraction radiation type | MoKα |