Information card for entry 7243867
Formula | C32 H26 Cd N4 O8 |
Calculated formula | C32 H26 Cd N4 O8 |
Title of publication | Various carboxylates induced eight Zn(ii)/Cd(ii) coordination polymers with fluorescence sensing activities for Fe(iii), Cr(vi) and oxytetracycline |
Authors of publication | Chen, Yaxuan; Liu, Guocheng; Wang, Xiuli; Lu, Xue; Xu, Na; Chang, Zhihan; Zhang, Zhong; Li, Xiaohui |
Journal of publication | CrystEngComm |
Year of publication | 2021 |
Journal volume | 23 |
Journal issue | 46 |
Pages of publication | 8077 - 8086 |
a | 21.4405 ± 0.0015 Å |
b | 10.1496 ± 0.0006 Å |
c | 27.784 ± 0.0018 Å |
α | 90° |
β | 108.755 ± 0.002° |
γ | 90° |
Cell volume | 5725.1 ± 0.6 Å3 |
Cell temperature | 296 ± 2 K |
Ambient diffraction temperature | 296 ± 2 K |
Number of distinct elements | 5 |
Space group number | 15 |
Hermann-Mauguin space group symbol | C 1 2/c 1 |
Hall space group symbol | -C 2yc |
Residual factor for all reflections | 0.06 |
Residual factor for significantly intense reflections | 0.0342 |
Weighted residual factors for significantly intense reflections | 0.0668 |
Weighted residual factors for all reflections included in the refinement | 0.0757 |
Goodness-of-fit parameter for all reflections included in the refinement | 0.966 |
Diffraction radiation wavelength | 0.71073 Å |
Diffraction radiation type | MoKα |