Information card for entry 7243879
Formula | C41 H43 Dy N10 O10 |
Calculated formula | C41 H43 Dy N10 O10 |
Title of publication | Synthesis, structures and magnetic properties of dysprosium(iii) complexes based on amino-bis(benzotriazole phenolate) and nitrophenolates: influence over the slow relaxation of the magnetization |
Authors of publication | Chen, Bo-Yi; Tsai, Min-Yem; Su, Yu-Chia; Lin, Po-Heng; Long, Jérôme |
Journal of publication | CrystEngComm |
Year of publication | 2021 |
Journal volume | 23 |
Journal issue | 47 |
Pages of publication | 8343 - 8350 |
a | 9.1671 ± 0.0005 Å |
b | 11.9694 ± 0.0008 Å |
c | 19.5627 ± 0.0011 Å |
α | 84.62 ± 0.005° |
β | 84.325 ± 0.005° |
γ | 88.419 ± 0.005° |
Cell volume | 2126.2 ± 0.2 Å3 |
Cell temperature | 150 ± 2 K |
Ambient diffraction temperature | 150.15 K |
Number of distinct elements | 5 |
Space group number | 2 |
Hermann-Mauguin space group symbol | P -1 |
Hall space group symbol | -P 1 |
Residual factor for all reflections | 0.0801 |
Residual factor for significantly intense reflections | 0.0615 |
Weighted residual factors for significantly intense reflections | 0.124 |
Weighted residual factors for all reflections included in the refinement | 0.1352 |
Goodness-of-fit parameter for all reflections included in the refinement | 1.047 |
Diffraction radiation wavelength | 0.71073 Å |
Diffraction radiation type | MoKα |