Information card for entry 7243883
Formula | C70 H77 Dy O7 Si3 |
Calculated formula | C70 H77 Dy O7 Si3 |
Title of publication | Tuning the coordination sphere of octahedral Dy(iii) complexes with silanolate/stannanolate ligands: synthesis, structures and slow relaxation of the magnetization |
Authors of publication | Long, Jérôme; Tolpygin, Aleksei O.; Cherkasov, Anton V.; Nelyubina, Yulia V.; Guari, Yannick; Larionova, Joulia; Trifonov, Alexander A. |
Journal of publication | CrystEngComm |
Year of publication | 2021 |
Journal volume | 23 |
Journal issue | 47 |
Pages of publication | 8351 - 8359 |
a | 14.334 ± 0.002 Å |
b | 16.468 ± 0.002 Å |
c | 14.54 ± 0.002 Å |
α | 90° |
β | 113.635 ± 0.003° |
γ | 90° |
Cell volume | 3144.3 ± 0.7 Å3 |
Cell temperature | 120 K |
Ambient diffraction temperature | 120 K |
Number of distinct elements | 5 |
Space group number | 4 |
Hermann-Mauguin space group symbol | P 1 21 1 |
Hall space group symbol | P 2yb |
Residual factor for all reflections | 0.0914 |
Residual factor for significantly intense reflections | 0.0564 |
Weighted residual factors for significantly intense reflections | 0.0996 |
Weighted residual factors for all reflections included in the refinement | 0.1104 |
Goodness-of-fit parameter for all reflections included in the refinement | 0.996 |
Diffraction radiation wavelength | 0.71073 Å |
Diffraction radiation type | MoKα |