Information card for entry 7243903
Formula | C54 H42 N14 Ni |
Calculated formula | C54 H42 N14 Ni |
Title of publication | Anion exchange strategy to improve electrocatalytic hydrogen evolution performances in cationic metal–organic frameworks |
Authors of publication | Li, Bei; Lei, Qingjuan; Qin, Tong; Zhang, Xiaoxian; Zhao, Dongsheng; Wang, Feng; Li, Wenqian; Zhang, Zhengguo; Fan, Liming |
Journal of publication | CrystEngComm |
Year of publication | 2021 |
Journal volume | 23 |
Journal issue | 47 |
Pages of publication | 8260 - 8264 |
a | 16.0135 ± 0.0006 Å |
b | 16.0135 ± 0.0006 Å |
c | 26.0061 ± 0.0014 Å |
α | 90° |
β | 90° |
γ | 120° |
Cell volume | 5775.4 ± 0.4 Å3 |
Cell temperature | 297 K |
Ambient diffraction temperature | 297 K |
Number of distinct elements | 4 |
Space group number | 148 |
Hermann-Mauguin space group symbol | R -3 :H |
Hall space group symbol | -R 3 |
Residual factor for all reflections | 0.0624 |
Residual factor for significantly intense reflections | 0.0569 |
Weighted residual factors for significantly intense reflections | 0.17 |
Weighted residual factors for all reflections included in the refinement | 0.176 |
Goodness-of-fit parameter for all reflections included in the refinement | 1.144 |
Diffraction radiation probe | x-ray |
Diffraction radiation wavelength | 1.54184 Å |
Diffraction radiation type | CuKα |