Information card for entry 7243950
Chemical name | 5,6,11,12-tetraphenyltetracene |
Formula | C42 H28 |
Calculated formula | C42 H28 |
Title of publication | Structure determination of small molecule compounds by an electron diffractometer for 3D ED/MicroED |
Authors of publication | Ito, Sho; White, Fraser J.; Okunishi, Eiji; Aoyama, Yoshitaka; Yamano, Akihito; Sato, Hiroyasu; Ferrara, Joseph D.; Jasnowski, Michał; Meyer, Mathias |
Journal of publication | CrystEngComm |
Year of publication | 2021 |
Journal volume | 23 |
Journal issue | 48 |
Pages of publication | 8622 - 8630 |
a | 26.34 ± 0.1 Å |
b | 7.03 ± 0.1 Å |
c | 14.16 ± 0.16 Å |
α | 90° |
β | 90° |
γ | 90° |
Cell volume | 2622 ± 5 Å3 |
Cell temperature | 293 K |
Ambient diffraction temperature | 293 K |
Number of distinct elements | 2 |
Space group number | 64 |
Hermann-Mauguin space group symbol | C m c e |
Hall space group symbol | -C 2ac 2 |
Residual factor for all reflections | 0.1178 |
Residual factor for significantly intense reflections | 0.092 |
Weighted residual factors for significantly intense reflections | 0.2275 |
Weighted residual factors for all reflections included in the refinement | 0.2452 |
Goodness-of-fit parameter for all reflections included in the refinement | 1.111 |
Diffraction radiation probe | electron |
Diffraction radiation wavelength | 0.0251 Å |
Diffraction radiation type | 200keVelectrons |